Target
Insulin-like growth factor 1 receptor
Ligand
BDBM10755
Substrate
Meas. Tech.
ChEMBL_632812 (CHEMBL1111026)
IC50
>50000±n/a nM
Citation
 Büttner, ACottin, TXu, JTzagkaroulaki, LGiannis, A Serotonin derivatives as a new class of non-ATP-competitive receptor tyrosine kinase inhibitors. Bioorg Med Chem 18:3387-402 (2010)  
Target
Name:
Insulin-like growth factor 1 receptor
Synonyms:
CD_antigen=CD221 IGF1R Insulin-like growth factor 1 receptor (IGF1R) Insulin-like growth factor 1 receptor alpha chain Insulin-like growth factor I receptor | Insulin-like growth factor receptor (IGFR)
Type:
Protein
Mol. Mass.:
154776.79
Organism:
Homo sapiens (Human)
Description:
P08069
Residue:
1367
  
Inhibitor
Name:
BDBM10755
Synonyms:
14C-5-hydroxy tryptamine creatinine disulfate 5-HT 5-hydroxy tryptamine creatinine disulfate Serotonin | [3H]-5-HT
Type:
Small organic molecule
Emp. Form.:
C10H12N2O
Mol. Mass.:
176.2151
SMILES:
NCCc1c[nH]c2ccc(O)cc12
: