Target
Adenosine receptor A1
Ligand
BDBM50316897
Substrate
Meas. Tech.
ChEMBL_629846 (CHEMBL1116483)
Ki
16.4±n/a nM
Citation
 Shook, BCRassnick, SChakravarty, DWallace, NAult, MCrooke, JBarbay, JKWang, ALeonard, KPowell, MTAlford, VHall, DRupert, KCHeintzelman, GRHansen, KBullington, JLScannevin, RHCarroll, KLampron, LWestover, LRussell, RBranum, SWells, KDamon, SYouells, SBeauchamp, DLi, XRhodes, KJackson, PF Optimization of arylindenopyrimidines as potent adenosine A(2A)/A(1) antagonists. Bioorg Med Chem Lett 20:2868-71 (2010)  
Target
Name:
Adenosine receptor A1
Synonyms:
A1 adenosine receptor (hA1) AA1R_HUMAN ADORA1 Adenosine A1-receptor Adenosine receptor A1 (hA1) | Adenosine transporter (AdT)
Type:
G Protein-Coupled Receptor (GPCR)
Mol. Mass.:
36520.92
Organism:
Homo sapiens (Human)
Description:
P30542
Residue:
326
  
Inhibitor
Name:
BDBM50316897
Synonyms:
2-amino-8-((1-ethylpiperidin-4-yl)(methyl)amino)-4-phenyl-5H-indeno[1,2-d]pyrimidin-5-one | CHEMBL1095813
Type:
Small organic molecule
Emp. Form.:
C25H27N5O
Mol. Mass.:
413.5148
SMILES:
CCN1CCC(CC1)N(C)c1ccc2C(=O)c3c(nc(N)nc3-c3ccccc3)-c2c1
: