Target
Adenosine receptor A2a
Ligand
BDBM50316900
Substrate
Meas. Tech.
ChEMBL_629845 (CHEMBL1116482)
Ki
11.4±n/a nM
Citation
 Shook, BCRassnick, SChakravarty, DWallace, NAult, MCrooke, JBarbay, JKWang, ALeonard, KPowell, MTAlford, VHall, DRupert, KCHeintzelman, GRHansen, KBullington, JLScannevin, RHCarroll, KLampron, LWestover, LRussell, RBranum, SWells, KDamon, SYouells, SBeauchamp, DLi, XRhodes, KJackson, PF Optimization of arylindenopyrimidines as potent adenosine A(2A)/A(1) antagonists. Bioorg Med Chem Lett 20:2868-71 (2010)  
Target
Name:
Adenosine receptor A2a
Synonyms:
A2A adenosine receptor (hA2A) ADENOSINE A2 ADORA2 Adenosine A2A receptor (A2AAR)
Type:
G Protein-Coupled Receptor (GPCR)
Mol. Mass.:
44716.46
Organism:
Homo sapiens (Human)
Description:
P29274
Residue:
412
  
Inhibitor
Name:
BDBM50316900
Synonyms:
2-amino-8-(4-ethylpiperazin-1-yl)-4-phenyl-5H-indeno[1,2-d]pyrimidin-5-one | CHEMBL1094244
Type:
Small organic molecule
Emp. Form.:
C23H23N5O
Mol. Mass.:
385.4616
SMILES:
CCN1CCN(CC1)c1ccc2C(=O)c3c(nc(N)nc3-c3ccccc3)-c2c1
: