Target
5-hydroxytryptamine receptor 2A
Ligand
BDBM50316967
Substrate
Meas. Tech.
ChEMBL_630117 (CHEMBL1113708)
Ki
>10000±n/a nM
Citation
 Fiorino, FSeverino, BDe Angelis, FPerissutti, EMagli, EFrecentese, FEsposito, AMassarelli, PNencini, CSantagada, VCaliendo, G New 5-HT(1A) receptor ligands containing a N'-cyanoisonicotinamidine nucleus: synthesis and in vitro pharmacological evaluation. Bioorg Med Chem Lett 20:2978-82 (2010)  
Target
Name:
5-hydroxytryptamine receptor 2A
Synonyms:
5-HT-2A 5-HT2A 5-hydroxytryptamine receptor 2A (5HT2A) Htr2 Serotonin Receptor 2A
Type:
G Protein-Coupled Receptor (GPCR)
Mol. Mass.:
52852.05
Organism:
Rattus norvegicus (rat)
Description:
Rat cortex membranes 5-HT2A receptors.
Residue:
471
  
Inhibitor
Name:
BDBM50316967
Synonyms:
CHEMBL1086958 | N-(3-(4-(3-chlorophenyl)piperazin-1-yl)propyl)-N'-cyanoisonicotinamidine
Type:
Small organic molecule
Emp. Form.:
C20H23ClN6
Mol. Mass.:
382.89
SMILES:
Clc1cccc(c1)N1CCN(CCCN=C(NC#N)c2ccncc2)CC1
: