Target
Adenosine receptor A2a
Ligand
BDBM50316993
Substrate
Meas. Tech.
ChEMBL_630130 (CHEMBL1113721)
Ki
3.6±n/a nM
Citation
 Shook, BCRassnick, SHall, DRupert, KCHeintzelman, GRHansen, KChakravarty, DBullington, JLScannevin, RHMagliaro, BWestover, LCarroll, KLampron, LRussell, RBranum, SWells, KDamon, SYouells, SLi, XOsbourne, MDemarest, KTang, YRhodes, KJackson, PF Methylene amine substituted arylindenopyrimidines as potent adenosine A(2A)/A(1) antagonists. Bioorg Med Chem Lett 20:2864-7 (2010)  
Target
Name:
Adenosine receptor A2a
Synonyms:
A2A adenosine receptor (hA2A) ADENOSINE A2 ADORA2 Adenosine A2A receptor (A2AAR)
Type:
G Protein-Coupled Receptor (GPCR)
Mol. Mass.:
44716.46
Organism:
Homo sapiens (Human)
Description:
P29274
Residue:
412
  
Inhibitor
Name:
BDBM50316993
Synonyms:
2-amino-4-(4-fluorophenyl)-9-(pyrrolidin-1-ylmethyl)-5H-indeno[1,2-d]pyrimidin-5-one | CHEMBL1087710
Type:
Small organic molecule
Emp. Form.:
C22H19FN4O
Mol. Mass.:
374.4109
SMILES:
Nc1nc2-c3c(cccc3CN3CCCC3)C(=O)c2c(n1)-c1ccc(F)cc1
: