Target
Beta-secretase 1
Ligand
BDBM50317053
Substrate
Meas. Tech.
ChEMBL_630324 (CHEMBL1109071)
Ki
14±n/a nM
Citation
 Cumming, JBabu, SHuang, YCarrol, CChen, XFavreau, LGreenlee, WGuo, TKennedy, MKuvelkar, RLe, TLi, GMcHugh, NOrth, POzgur, LParker, ESaionz, KStamford, AStrickland, CTadesse, DVoigt, JZhang, LZhang, Q Piperazine sulfonamide BACE1 inhibitors: design, synthesis, and in vivo characterization. Bioorg Med Chem Lett 20:2837-42 (2010)  
Target
Name:
Beta-secretase 1
Synonyms:
ASP2 Aspartyl protease 2 BACE1 Beta-secretase (BACE) Beta-secretase 1 (BACE 1) Beta-secretase 1 (BACE1) Beta-site amyloid precursor protein cleaving enzyme 1 Memapsin-2 beta-Secretase (BACE-1) | beta-Secretase (BACE1)
Type:
Protein
Mol. Mass.:
55755.10
Organism:
Homo sapiens (Human)
Description:
P56817
Residue:
501
  
Inhibitor
Name:
BDBM50317053
Synonyms:
1-butyl-N-((1S,2S)-3-(3,5-difluorophenyl)-1-hydroxy-1-((R)-4-(m-tolylsulfonyl)piperazin-2-yl)propan-2-yl)-5-oxopyrrolidine-3-carboxamide | CHEMBL1097347
Type:
Small organic molecule
Emp. Form.:
C29H38F2N4O5S
Mol. Mass.:
592.698
SMILES:
CCCCN1CC(CC1=O)C(=O)N[C@@H](Cc1cc(F)cc(F)c1)[C@H](O)[C@H]1CN(CCN1)S(=O)(=O)c1cccc(C)c1
: