Target
Leukotriene B4 receptor 2
Ligand
BDBM50317626
Substrate
Meas. Tech.
ChEMBL_632892 (CHEMBL1107474)
IC50
164±n/a nM
Target
Name:
Leukotriene B4 receptor 2
Synonyms:
BLT2R LT4R2_HUMAN LTB4-R 2 LTB4R2 Leukotriene B4 Leukotriene B4 receptor Leukotriene B4 receptor BLT2 Seven transmembrane receptor BLTR2
Type:
Enzyme Catalytic Domain
Mol. Mass.:
37964.86
Organism:
Homo sapiens (Human)
Description:
Leukotriene 2 0 HUMAN::Q9NPC1
Residue:
358
  
Inhibitor
Name:
BDBM50317626
Synonyms:
4-{3-[6-(3-5-Benzo[1,3]dioxolyl-5-thiophen-3-ylphenoxy)hexyl]-2-(2-carboxyethyl)phenoxy}butyric Acid | CHEMBL1098560
Type:
Small organic molecule
Emp. Form.:
C36H38O8S
Mol. Mass.:
630.747
SMILES:
OC(=O)CCCOc1cccc(CCCCCCOc2cc(cc(c2)-c2ccc3OCOc3c2)-c2ccsc2)c1CCC(O)=O
: