Target
Cytochrome P450 1A2
Ligand
BDBM50317626
Substrate
Meas. Tech.
ChEMBL_632900 (CHEMBL1107482)
IC50
>7500±n/a nM
Target
Name:
Cytochrome P450 1A2
Synonyms:
CP1A2_HUMAN CYPIA2 Cytochrome P(3)450 Cytochrome P450 1A2 (CYP1A2) Cytochrome P450-P3
Type:
Enzyme
Mol. Mass.:
58423.38
Organism:
Homo sapiens (Human)
Description:
P05177
Residue:
516
  
Inhibitor
Name:
BDBM50317626
Synonyms:
4-{3-[6-(3-5-Benzo[1,3]dioxolyl-5-thiophen-3-ylphenoxy)hexyl]-2-(2-carboxyethyl)phenoxy}butyric Acid | CHEMBL1098560
Type:
Small organic molecule
Emp. Form.:
C36H38O8S
Mol. Mass.:
630.747
SMILES:
OC(=O)CCCOc1cccc(CCCCCCOc2cc(cc(c2)-c2ccc3OCOc3c2)-c2ccsc2)c1CCC(O)=O
: