Target
Oxysterols receptor LXR-beta
Ligand
BDBM50317740
Substrate
Meas. Tech.
ChEMBL_629445 (CHEMBL1105798)
EC50
1080±n/a nM
Citation
 Ullrich, JWMorris, RBernotas, RCTravins, JMJetter, JUnwalla, RQuinet, ENambi, PFeingold, IHuselton, CEnroth, CWilhelmsson, AGoos-Nilsson, AWrobel, J Synthesis of 4-(3-biaryl)quinoline sulfones as potent liver X receptor agonists. Bioorg Med Chem Lett 20:2903-7 (2010)  
Target
Name:
Oxysterols receptor LXR-beta
Synonyms:
LXRB Liver X, LXR beta NR1H2 Nuclear receptor NER Ubiquitously-expressed nuclear receptor
Type:
Enzyme Catalytic Domain
Mol. Mass.:
50978.79
Organism:
Homo sapiens (Human)
Description:
P55055
Residue:
460
  
Inhibitor
Name:
BDBM50317740
Synonyms:
4-(3'-(ethylsulfonyl)biphenyl-3-yl)-8-(trifluoromethyl)quinoline | CHEMBL1098831
Type:
Small organic molecule
Emp. Form.:
C24H18F3NO2S
Mol. Mass.:
441.465
SMILES:
CCS(=O)(=O)c1cccc(c1)-c1cccc(c1)-c1ccnc2c(cccc12)C(F)(F)F
: