Target
Oxysterols receptor LXR-alpha
Ligand
BDBM19993
Substrate
Meas. Tech.
ChEMBL_629444 (CHEMBL1105797)
IC50
13±n/a nM
Citation
 Ullrich, JWMorris, RBernotas, RCTravins, JMJetter, JUnwalla, RQuinet, ENambi, PFeingold, IHuselton, CEnroth, CWilhelmsson, AGoos-Nilsson, AWrobel, J Synthesis of 4-(3-biaryl)quinoline sulfones as potent liver X receptor agonists. Bioorg Med Chem Lett 20:2903-7 (2010)  
Target
Name:
Oxysterols receptor LXR-alpha
Synonyms:
LXRA Liver X receptor alpha Liver X receptor alpha (NR1H3) NR1H3 Nuclear orphan receptor LXR-alpha | Nuclear receptor subfamily 1 group H member 3
Type:
Enzyme Catalytic Domain
Mol. Mass.:
50403.85
Organism:
Homo sapiens (Human)
Description:
Q13133
Residue:
447
  
Inhibitor
Name:
BDBM19993
Synonyms:
CHEMBL62136 T 0901317 TO-901317 US10669296, Compound TO901317 [3H]T0901317
Type:
Small organic molecule
Emp. Form.:
C17H12F9NO3S
Mol. Mass.:
481.333
SMILES:
OC(c1ccc(cc1)N(CC(F)(F)F)S(=O)(=O)c1ccccc1)(C(F)(F)F)C(F)(F)F
: