Target
Oxysterols receptor LXR-alpha
Ligand
BDBM50317731
Substrate
Meas. Tech.
ChEMBL_629444 (CHEMBL1105797)
IC50
68±n/a nM
Citation
 Ullrich, JWMorris, RBernotas, RCTravins, JMJetter, JUnwalla, RQuinet, ENambi, PFeingold, IHuselton, CEnroth, CWilhelmsson, AGoos-Nilsson, AWrobel, J Synthesis of 4-(3-biaryl)quinoline sulfones as potent liver X receptor agonists. Bioorg Med Chem Lett 20:2903-7 (2010)  
Target
Name:
Oxysterols receptor LXR-alpha
Synonyms:
LXRA Liver X receptor alpha Liver X receptor alpha (NR1H3) NR1H3 Nuclear orphan receptor LXR-alpha | Nuclear receptor subfamily 1 group H member 3
Type:
Enzyme Catalytic Domain
Mol. Mass.:
50403.85
Organism:
Homo sapiens (Human)
Description:
Q13133
Residue:
447
  
Inhibitor
Name:
BDBM50317731
Synonyms:
4-(3'-(methylsulfonyl)biphenyl-3-yl)-8-(trifluoromethyl)quinoline | CHEMBL1095714
Type:
Small organic molecule
Emp. Form.:
C23H16F3NO2S
Mol. Mass.:
427.439
SMILES:
CS(=O)(=O)c1cccc(c1)-c1cccc(c1)-c1ccnc2c(cccc12)C(F)(F)F
: