Target
Oxysterols receptor LXR-alpha
Ligand
BDBM50317744
Substrate
Meas. Tech.
ChEMBL_629444 (CHEMBL1105797)
IC50
10±n/a nM
Citation
 Ullrich, JWMorris, RBernotas, RCTravins, JMJetter, JUnwalla, RQuinet, ENambi, PFeingold, IHuselton, CEnroth, CWilhelmsson, AGoos-Nilsson, AWrobel, J Synthesis of 4-(3-biaryl)quinoline sulfones as potent liver X receptor agonists. Bioorg Med Chem Lett 20:2903-7 (2010)  
Target
Name:
Oxysterols receptor LXR-alpha
Synonyms:
LXRA Liver X receptor alpha Liver X receptor alpha (NR1H3) NR1H3 Nuclear orphan receptor LXR-alpha | Nuclear receptor subfamily 1 group H member 3
Type:
Enzyme Catalytic Domain
Mol. Mass.:
50403.85
Organism:
Homo sapiens (Human)
Description:
Q13133
Residue:
447
  
Inhibitor
Name:
BDBM50317744
Synonyms:
4-(4'-fluoro-3'-(methylsulfonyl)biphenyl-3-yl)-3-methyl-8-(trifluoromethyl)quinoline | CHEMBL1097158
Type:
Small organic molecule
Emp. Form.:
C24H17F4NO2S
Mol. Mass.:
459.456
SMILES:
Cc1cnc2c(cccc2c1-c1cccc(c1)-c1ccc(F)c(c1)S(C)(=O)=O)C(F)(F)F
: