Target
Prostaglandin G/H synthase 1
Ligand
BDBM50317930
Substrate
Meas. Tech.
ChEMBL_630412 (CHEMBL1113783)
IC50
28850±n/a nM
Citation
 Singh, PBhardwaj, A Mono-, di-, and triaryl substituted tetrahydropyrans as cyclooxygenase-2 and tumor growth inhibitors. Synthesis and biological evaluation. J Med Chem 53:3707-17 (2010)  
Target
Name:
Prostaglandin G/H synthase 1
Synonyms:
COX1 Cyclooxygenase-1 (COX-1) PTGS1 | Prostaglandin G/H synthase (cyclooxygenase)
Type:
Protein
Mol. Mass.:
68868.60
Organism:
Ovis aries (Sheep)
Description:
Residue:
600
  
Inhibitor
Name:
BDBM50317930
Synonyms:
(2R*,3S*,4R*,6S*)-2-(4-Fluorophenyl)tetrahydro-3,4-diphenyl-6-(thiocyanatomethyl)-2H-pyran-4-ol | CHEMBL1098066
Type:
Small organic molecule
Emp. Form.:
C25H22FNO2S
Mol. Mass.:
419.511
SMILES:
O[C@@]1(C[C@@H](CSC#N)O[C@H]([C@@H]1c1ccccc1)c1ccc(F)cc1)c1ccccc1
: