Target
Beta-secretase 1
Ligand
BDBM50318125
Substrate
Meas. Tech.
ChEMBL_632138 (CHEMBL1103872)
Ki
8±n/a nM
Citation
 Huang, YStrobel, EDHo, CYReynolds, CHConway, KAPiesvaux, JABrenneman, DEYohrling, GJMoore Arnold, HRosenthal, DAlexander, RSTounge, BAMercken, MVandermeeren, MParker, MHReitz, ABBaxter, EW Macrocyclic BACE inhibitors: Optimization of a micromolar hit to nanomolar leads. Bioorg Med Chem Lett 20:3158-60 (2010)  
Target
Name:
Beta-secretase 1
Synonyms:
ASP2 Aspartyl protease 2 BACE1 Beta-secretase (BACE) Beta-secretase 1 (BACE 1) Beta-secretase 1 (BACE1) Beta-site amyloid precursor protein cleaving enzyme 1 Memapsin-2 beta-Secretase (BACE-1) | beta-Secretase (BACE1)
Type:
Protein
Mol. Mass.:
55755.10
Organism:
Homo sapiens (Human)
Description:
P56817
Residue:
501
  
Inhibitor
Name:
BDBM50318125
Synonyms:
(14S)-16-amino-10-cyclohexyl-14-(propan-2-yl)-2-oxa-10,15,17-triazatetracyclo[13.5.3.1^{3,7}.0^{18,22}]tetracosa-1(21),3(24),4,6,16,18(22),19-heptaen-11-one | CHEMBL1098082
Type:
Small organic molecule
Emp. Form.:
C29H38N4O2
Mol. Mass.:
474.6376
SMILES:
CC(C)[C@@H]1CCC(=O)N(CCc2cccc(Oc3ccc4N=C(N)N1Cc4c3)c2)C1CCCCC1
: