Target
Acetylcholinesterase
Ligand
BDBM9045
Substrate
Meas. Tech.
ChEMBL_633769 (CHEMBL1119333)
IC50
75±n/a nM
Citation
 Lv, WXue, Y Prediction of acetylcholinesterase inhibitors and characterization of correlative molecular descriptors by machine learning methods. Eur J Med Chem 45:1167-72 (2010)  
Target
Name:
Acetylcholinesterase
Synonyms:
ACES_HUMAN Acetylcholinesterase (AChE) | Acetylcholinesterase (human AChE)
Type:
Enzyme
Mol. Mass.:
67792.70
Organism:
Homo sapiens (Human)
Description:
P22303
Residue:
614
  
Inhibitor
Name:
BDBM9045
Synonyms:
Homodimeric Tacrine Analog 2b N-(7-{1H,2H,3H-cyclopenta[b]quinolin-9-ylamino}heptyl)-1H,2H,3H-cyclopenta[b]quinolin-9-amine
Type:
Small organic molecule
Emp. Form.:
C31H36N4
Mol. Mass.:
464.6443
SMILES:
C(CCCNc1c2CCCc2nc2ccccc12)CCCNc1c2CCCc2nc2ccccc12
: