Target
Acetylcholinesterase
Ligand
BDBM9056
Substrate
Meas. Tech.
ChEMBL_633769 (CHEMBL1119333)
IC50
4.8±n/a nM
Citation
 Lv, WXue, Y Prediction of acetylcholinesterase inhibitors and characterization of correlative molecular descriptors by machine learning methods. Eur J Med Chem 45:1167-72 (2010)  
Target
Name:
Acetylcholinesterase
Synonyms:
ACES_HUMAN Acetylcholinesterase (AChE) | Acetylcholinesterase (human AChE)
Type:
Enzyme
Mol. Mass.:
67792.70
Organism:
Homo sapiens (Human)
Description:
P22303
Residue:
614
  
Inhibitor
Name:
BDBM9056
Synonyms:
Homodimeric Tacrine Analog 3j N-(6-{6H,7H,8H,9H-cyclohexa[b]1,8-naphthyridin-5-ylamino}hexyl)-6H,7H,8H,9H-cyclohexa[b]1,8-naphthyridin-5-amine
Type:
Small organic molecule
Emp. Form.:
C30H36N6
Mol. Mass.:
480.647
SMILES:
C(CCCNc1c2CCCCc2nc2ncccc12)CCNc1c2CCCCc2nc2ncccc12
: