Target
Acetylcholinesterase
Ligand
BDBM9060
Substrate
Meas. Tech.
ChEMBL_633769 (CHEMBL1119333)
IC50
2.7±n/a nM
Citation
 Lv, WXue, Y Prediction of acetylcholinesterase inhibitors and characterization of correlative molecular descriptors by machine learning methods. Eur J Med Chem 45:1167-72 (2010)  
Target
Name:
Acetylcholinesterase
Synonyms:
ACES_HUMAN Acetylcholinesterase (AChE) | Acetylcholinesterase (human AChE)
Type:
Enzyme
Mol. Mass.:
67792.70
Organism:
Homo sapiens (Human)
Description:
P22303
Residue:
614
  
Inhibitor
Name:
BDBM9060
Synonyms:
Homodimeric Tacrine Analog 4b N-(7-{6H,7H,8H,9H,10H-cyclohepta[b]quinolin-11-ylamino}heptyl)-6H,7H,8H,9H,10H-cyclohepta[b]quinolin-11-amine
Type:
Small organic molecule
Emp. Form.:
C35H44N4
Mol. Mass.:
520.7507
SMILES:
C(CCCNc1c2CCCCCc2nc2ccccc12)CCCNc1c2CCCCCc2nc2ccccc12
: