Target
Acetylcholinesterase
Ligand
BDBM9005
Substrate
Meas. Tech.
ChEMBL_633769 (CHEMBL1119333)
IC50
45±n/a nM
Citation
 Lv, WXue, Y Prediction of acetylcholinesterase inhibitors and characterization of correlative molecular descriptors by machine learning methods. Eur J Med Chem 45:1167-72 (2010)  
Target
Name:
Acetylcholinesterase
Synonyms:
ACES_HUMAN Acetylcholinesterase (AChE) | Acetylcholinesterase (human AChE)
Type:
Enzyme
Mol. Mass.:
67792.70
Organism:
Homo sapiens (Human)
Description:
P22303
Residue:
614
  
Inhibitor
Name:
BDBM9005
Synonyms:
6-fluoro-N-heptyl-1,2,3,4-tetrahydroacridin-9-amine | Tacrine Analogue 22
Type:
Small organic molecule
Emp. Form.:
C20H27FN2
Mol. Mass.:
314.4402
SMILES:
CCCCCCCNc1c2CCCCc2nc2cc(F)ccc12
: