Target
Acetylcholinesterase
Ligand
BDBM50004020
Substrate
Meas. Tech.
ChEMBL_633769 (CHEMBL1119333)
IC50
80±n/a nM
Citation
 Lv, WXue, Y Prediction of acetylcholinesterase inhibitors and characterization of correlative molecular descriptors by machine learning methods. Eur J Med Chem 45:1167-72 (2010)  
Target
Name:
Acetylcholinesterase
Synonyms:
ACES_HUMAN Acetylcholinesterase (AChE) | Acetylcholinesterase (human AChE)
Type:
Enzyme
Mol. Mass.:
67792.70
Organism:
Homo sapiens (Human)
Description:
P22303
Residue:
614
  
Inhibitor
Name:
BDBM50004020
Synonyms:
2-(2-(1-benzylpiperidin-4-yl)ethyl)isoindoline-1,3-dione CHEMBL106891 | CHEMBL541625
Type:
Small organic molecule
Emp. Form.:
C22H24N2O2
Mol. Mass.:
348.4382
SMILES:
O=C1N(CCC2CCN(Cc3ccccc3)CC2)C(=O)c2ccccc12
: