Target
Acetylcholinesterase
Ligand
BDBM50004010
Substrate
Meas. Tech.
ChEMBL_633769 (CHEMBL1119333)
IC50
3000±n/a nM
Citation
 Lv, WXue, Y Prediction of acetylcholinesterase inhibitors and characterization of correlative molecular descriptors by machine learning methods. Eur J Med Chem 45:1167-72 (2010)  
Target
Name:
Acetylcholinesterase
Synonyms:
ACES_HUMAN Acetylcholinesterase (AChE) | Acetylcholinesterase (human AChE)
Type:
Enzyme
Mol. Mass.:
67792.70
Organism:
Homo sapiens (Human)
Description:
P22303
Residue:
614
  
Inhibitor
Name:
BDBM50004010
Synonyms:
2-((1-benzylpiperidin-4-yl)methyl)-5-nitroisoindoline-1,3-dione CHEMBL326868
Type:
Small organic molecule
Emp. Form.:
C21H21N3O4
Mol. Mass.:
379.4091
SMILES:
[O-][N+](=O)c1ccc2C(=O)N(CC3CCN(Cc4ccccc4)CC3)C(=O)c2c1
: