Target
Acetylcholinesterase
Ligand
BDBM50004034
Substrate
Meas. Tech.
ChEMBL_633769 (CHEMBL1119333)
IC50
340±n/a nM
Citation
 Lv, WXue, Y Prediction of acetylcholinesterase inhibitors and characterization of correlative molecular descriptors by machine learning methods. Eur J Med Chem 45:1167-72 (2010)  
Target
Name:
Acetylcholinesterase
Synonyms:
ACES_HUMAN Acetylcholinesterase (AChE) | Acetylcholinesterase (human AChE)
Type:
Enzyme
Mol. Mass.:
67792.70
Organism:
Homo sapiens (Human)
Description:
P22303
Residue:
614
  
Inhibitor
Name:
BDBM50004034
Synonyms:
CHEMBL141622 N-{2-[2-(1-Benzyl-piperidin-4-yl)-ethyl]-1,3-dioxo-2,3-dihydro-1H-isoindol-4-yl}-benzamide
Type:
Small organic molecule
Emp. Form.:
C29H29N3O3
Mol. Mass.:
467.5589
SMILES:
O=C(Nc1cccc2C(=O)N(CCC3CCN(Cc4ccccc4)CC3)C(=O)c12)c1ccccc1
: