Target
Acetylcholinesterase
Ligand
BDBM50004003
Substrate
Meas. Tech.
ChEMBL_633769 (CHEMBL1119333)
IC50
1000±n/a nM
Citation
 Lv, WXue, Y Prediction of acetylcholinesterase inhibitors and characterization of correlative molecular descriptors by machine learning methods. Eur J Med Chem 45:1167-72 (2010)  
Target
Name:
Acetylcholinesterase
Synonyms:
ACES_HUMAN Acetylcholinesterase (AChE) | Acetylcholinesterase (human AChE)
Type:
Enzyme
Mol. Mass.:
67792.70
Organism:
Homo sapiens (Human)
Description:
P22303
Residue:
614
  
Inhibitor
Name:
BDBM50004003
Synonyms:
2-(2-(1-benzylpiperidin-4-yl)ethyl)-3,4-dihydroisoquinolin-1(2H)-one CHEMBL142014
Type:
Small organic molecule
Emp. Form.:
C23H28N2O
Mol. Mass.:
348.4812
SMILES:
O=C1N(CCC2CCN(Cc3ccccc3)CC2)CCc2ccccc12
: