Target
Acetylcholinesterase
Ligand
BDBM50318786
Substrate
Meas. Tech.
ChEMBL_633769 (CHEMBL1119333)
IC50
0.48±n/a nM
Citation
 Lv, WXue, Y Prediction of acetylcholinesterase inhibitors and characterization of correlative molecular descriptors by machine learning methods. Eur J Med Chem 45:1167-72 (2010)  
Target
Name:
Acetylcholinesterase
Synonyms:
ACES_HUMAN Acetylcholinesterase (AChE) | Acetylcholinesterase (human AChE)
Type:
Enzyme
Mol. Mass.:
67792.70
Organism:
Homo sapiens (Human)
Description:
P22303
Residue:
614
  
Inhibitor
Name:
BDBM50318786
Synonyms:
3-(2-(1-benzylpiperidin-4-yl)ethyl)-7,8-dihydroisoxazolo[4,5-g]quinolin-6(5H)-one | CHEMBL1083069
Type:
Small organic molecule
Emp. Form.:
C24H27N3O2
Mol. Mass.:
389.4901
SMILES:
O=C1CNc2cc3onc(CCC4CCN(Cc5ccccc5)CC4)c3cc2C1
: