Target
Acetylcholinesterase
Ligand
BDBM10938
Substrate
Meas. Tech.
ChEMBL_633769 (CHEMBL1119333)
IC50
0.7±n/a nM
Citation
 Lv, WXue, Y Prediction of acetylcholinesterase inhibitors and characterization of correlative molecular descriptors by machine learning methods. Eur J Med Chem 45:1167-72 (2010)  
Target
Name:
Acetylcholinesterase
Synonyms:
ACES_HUMAN Acetylcholinesterase (AChE) | Acetylcholinesterase (human AChE)
Type:
Enzyme
Mol. Mass.:
67792.70
Organism:
Homo sapiens (Human)
Description:
P22303
Residue:
614
  
Inhibitor
Name:
BDBM10938
Synonyms:
3-[({3-[(9-oxo-9H-xanthen-3-yl)oxy]propyl}(propan-2-yl)amino)methyl]phenyl N-methylcarbamate | aminoalkoxyheteroaryl deriv. 31
Type:
Small organic molecule
Emp. Form.:
C28H30N2O5
Mol. Mass.:
474.5482
SMILES:
CNC(=O)Oc1cccc(CN(CCCOc2ccc3c(c2)oc2ccccc2c3=O)C(C)C)c1
: