Target
Acetylcholinesterase
Ligand
BDBM10920
Substrate
Meas. Tech.
ChEMBL_633769 (CHEMBL1119333)
IC50
1.1±n/a nM
Citation
 Lv, WXue, Y Prediction of acetylcholinesterase inhibitors and characterization of correlative molecular descriptors by machine learning methods. Eur J Med Chem 45:1167-72 (2010)  
Target
Name:
Acetylcholinesterase
Synonyms:
ACES_HUMAN Acetylcholinesterase (AChE) | Acetylcholinesterase (human AChE)
Type:
Enzyme
Mol. Mass.:
67792.70
Organism:
Homo sapiens (Human)
Description:
P22303
Residue:
614
  
Inhibitor
Name:
BDBM10920
Synonyms:
3-({methyl[3-({5-oxo-5H-chromeno[2,3-b]pyridin-8-yl}oxy)propyl]amino}methyl)phenyl N-methylcarbamate hydrochloride aminoalkoxyheteroaryl deriv. 13
Type:
Small organic molecule
Emp. Form.:
C25H25N3O5
Mol. Mass.:
447.4831
SMILES:
CNC(=O)Oc1cccc(CN(C)CCCOc2ccc3c(c2)oc2ncccc2c3=O)c1
: