Target
Cathepsin K
Ligand
BDBM19855
Substrate
Meas. Tech.
ChEMBL_633770 (CHEMBL1119720)
IC50
1.4±n/a nM
Citation
 Allen, JGFotsch, CBabij, P Emerging targets in osteoporosis disease modification. J Med Chem 53:4332-53 (2010)  
Target
Name:
Cathepsin K
Synonyms:
CATK_HUMAN CTSO Cathepsin O Cathepsin X
Type:
Enzyme
Mol. Mass.:
36975.68
Organism:
Homo sapiens (Human)
Description:
P43235
Residue:
329
  
Inhibitor
Name:
BDBM19855
Synonyms:
Balicatib N-[1-(cyanomethylcarbamoyl)cyclohexyl]-4-(4-propylpiperazin-1-yl) basic piperazine-containing compound, 10
Type:
Small organic molecule
Emp. Form.:
C23H33N5O2
Mol. Mass.:
411.5404
SMILES:
CCCN1CCN(CC1)c1ccc(cc1)C(=O)NC1(CCCCC1)C(=O)NCC#N
: