Target
Hydroxycarboxylic acid receptor 2
Ligand
BDBM50273099
Substrate
Meas. Tech.
ChEMBL_633683 (CHEMBL1118308)
EC50
286±n/a nM
Citation
 Boatman, PDSchrader, TOKasem, MJohnson, BRSkinner, PJJung, JKXu, JCherrier, MCWebb, PJSemple, GSage, CRKnudsen, JChen, RTaggart, AKCarballo-Jane, ERichman, JG Potent tricyclic pyrazole tetrazole agonists of the nicotinic acid receptor (GPR109a). Bioorg Med Chem Lett 20:2797-800 (2010)  
Target
Name:
Hydroxycarboxylic acid receptor 2
Synonyms:
G-protein coupled receptor 109A GPR109A HCAR2 HM74A NIACR1 Nicotinic acid receptor 1
Type:
G Protein-Coupled Receptor (GPCR)
Mol. Mass.:
41868.22
Organism:
Homo sapiens (Human)
Description:
Membranes from CHO cells expressing the recombinant human GPR109A were used in competition binding assay.
Residue:
363
  
Inhibitor
Name:
BDBM50273099
Synonyms:
3-(1H-tetrazol-5-yl)-1,4,5,6-tetrahydrocyclopenta[c]pyrazole CHEMBL456145 | MK-0354
Type:
Small organic molecule
Emp. Form.:
C7H8N6
Mol. Mass.:
176.1786
SMILES:
C1Cc2[nH]nc(c2C1)-c1nnn[nH]1
: