Target
Substance-P receptor
Ligand
BDBM50318932
Substrate
Meas. Tech.
ChEMBL_635273 (CHEMBL1118377)
Ki
2.24±n/a nM
Citation
 Peters, JUHoffmann, TSchnider, PStadler, HKoblet, AAlker, APoli, SMBallard, TMSpooren, WSteward, LSleight, AJ Discovery of potent, balanced and orally active dual NK1/NK3 receptor ligands. Bioorg Med Chem Lett 20:3405-8 (2010)  
Target
Name:
Substance-P receptor
Synonyms:
NK-1 receptor NK1 Receptor NK1R_HUMAN Neurokinin-1 (NK-1) SPR TACR1 Tachykinin receptor 1 (NK1) | tachykinin
Type:
G Protein-Coupled Receptor (GPCR)
Mol. Mass.:
46254.43
Organism:
Homo sapiens (Human)
Description:
P25103
Residue:
407
  
Inhibitor
Name:
BDBM50318932
Synonyms:
2-(3,5-bis(trifluoromethyl)phenyl)-N-(4-(2-chlorophenyl)-6-((2-hydroxyethyl)(propyl)amino)pyridin-3-yl)-N,2-dimethylpropanamide | CHEMBL1084525
Type:
Small organic molecule
Emp. Form.:
C29H30ClF6N3O2
Mol. Mass.:
602.011
SMILES:
CCCN(CCO)c1cc(c(cn1)N(C)C(=O)C(C)(C)c1cc(cc(c1)C(F)(F)F)C(F)(F)F)-c1ccccc1Cl
: