Target
Beta-2 adrenergic receptor
Ligand
BDBM50318981
Substrate
Meas. Tech.
ChEMBL_635468 (CHEMBL1120618)
Ki
17±n/a nM
Citation
 Tasler, SBaumgartner, RAschenbrenner, AAmmendola, AWolf, KWieber, TSchachtner, JBlisse, MQuotschalla, UNey, P A vHTS approach for the identification of beta-adrenoceptor ligands. Bioorg Med Chem Lett 20:3399-404 (2010)  
Target
Name:
Beta-2 adrenergic receptor
Synonyms:
ADRB2 ADRB2_HUMAN Beta-2 adrenoceptor | Beta-2 adrenoreceptor
Type:
Mol. Mass.:
46461.69
Organism:
Homo sapiens (Human)
Description:
P07550
Residue:
413
  
Inhibitor
Name:
BDBM50318981
Synonyms:
1-(2-isopropylphenoxy)-3-(1-methylpiperidin-4-ylamino)propan-2-ol | CHEMBL1083670
Type:
Small organic molecule
Emp. Form.:
C18H30N2O2
Mol. Mass.:
306.443
SMILES:
CC(C)c1ccccc1OCC(O)CNC1CCN(C)CC1
: