Target
Beta-1 adrenergic receptor
Ligand
BDBM50318983
Substrate
Meas. Tech.
ChEMBL_635472 (CHEMBL1120622)
Ki
0.100000±n/a nM
Citation
 Tasler, SBaumgartner, RAschenbrenner, AAmmendola, AWolf, KWieber, TSchachtner, JBlisse, MQuotschalla, UNey, P A vHTS approach for the identification of beta-adrenoceptor ligands. Bioorg Med Chem Lett 20:3399-404 (2010)  
Target
Name:
Beta-1 adrenergic receptor
Synonyms:
ADRB1 ADRB1_HUMAN Beta-1 adrenoceptor | adrenergic Beta1
Type:
G Protein-Coupled Receptor (GPCR)
Mol. Mass.:
51338.40
Organism:
Homo sapiens (Human)
Description:
P08588
Residue:
477
  
Inhibitor
Name:
BDBM50318983
Synonyms:
2-((1-(3-(9H-carbazol-4-yloxy)-2-hydroxypropyl)piperidin-4-yl)methyl)-5-methoxy-1H-benzo[de]isoquinoline-1,3(2H)-dione | CHEMBL1084707
Type:
Small organic molecule
Emp. Form.:
C34H33N3O5
Mol. Mass.:
563.6429
SMILES:
COc1cc2C(=O)N(CC3CCN(CC(O)COc4cccc5[nH]c6ccccc6c45)CC3)C(=O)c3cccc(c1)c23
: