Target
Aurora kinase B
Ligand
BDBM50319625
Substrate
Meas. Tech.
ChEMBL_634452 (CHEMBL1119478)
Ki
33±n/a nM
Citation
 Wang, SMidgley, CAScaërou, FGrabarek, JBGriffiths, GJackson, WKontopidis, GMcClue, SJMcInnes, CMeades, CMezna, MPlater, AStuart, IThomas, MPWood, GClarke, RGBlake, DGZheleva, DILane, DPJackson, RCGlover, DMFischer, PM Discovery of N-phenyl-4-(thiazol-5-yl)pyrimidin-2-amine aurora kinase inhibitors. J Med Chem 53:4367-78 (2010)  
Target
Name:
Aurora kinase B
Synonyms:
AIK2 AIM1 ARK2 AURKB_HUMAN Aurora B-INCENP Aurora kinase B (AURKB) STK-1 STK12 Serine/threonine-protein kinase aurora B
Type:
Protein
Mol. Mass.:
39327.72
Organism:
Homo sapiens (Human)
Description:
Q96GD4
Residue:
344
  
Inhibitor
Name:
BDBM50319625
Synonyms:
CHEMBL1083150 | N1-(4-(2,4-Dimethylthiazol-5-yl)pyrimidin-2-yl)-N4-methylbenzene-1,4-diamine
Type:
Small organic molecule
Emp. Form.:
C16H17N5S
Mol. Mass.:
311.405
SMILES:
CNc1ccc(Nc2nccc(n2)-c2sc(C)nc2C)cc1
: