Target
Aurora kinase A
Ligand
BDBM50319626
Substrate
Meas. Tech.
ChEMBL_634451 (CHEMBL1119477)
Ki
9.2±n/a nM
Citation
 Wang, SMidgley, CAScaërou, FGrabarek, JBGriffiths, GJackson, WKontopidis, GMcClue, SJMcInnes, CMeades, CMezna, MPlater, AStuart, IThomas, MPWood, GClarke, RGBlake, DGZheleva, DILane, DPJackson, RCGlover, DMFischer, PM Discovery of N-phenyl-4-(thiazol-5-yl)pyrimidin-2-amine aurora kinase inhibitors. J Med Chem 53:4367-78 (2010)  
Target
Name:
Aurora kinase A
Synonyms:
AIK ARK1 AURKA AYK1 Aurora kinase A (AURA) Aurora kinase A (Aurora A) Aurora-related kinase 1 BTAK Breast-tumor-amplified kinase STK15 Serine/threonine kinase 15 Serine/threonine-protein kinase aurora A hARK1
Type:
Serine/threonine-protein kinase
Mol. Mass.:
45830.98
Organism:
Homo sapiens (Human)
Description:
O14965
Residue:
403
  
Inhibitor
Name:
BDBM50319626
Synonyms:
4-(2,4-Dimethylthiazol-5-yl)-N-(4-(4-(methylsulfonyl)piperazin-1-yl)phenyl)pyrimidin-2-amine | CHEMBL1083484
Type:
Small organic molecule
Emp. Form.:
C20H24N6O2S2
Mol. Mass.:
444.574
SMILES:
Cc1nc(C)c(s1)-c1ccnc(Nc2ccc(cc2)N2CCN(CC2)S(C)(=O)=O)n1
: