Target
Cyclin-dependent kinase 4
Ligand
BDBM50319615
Substrate
Meas. Tech.
ChEMBL_634456 (CHEMBL1119482)
Ki
22±n/a nM
Citation
 Wang, SMidgley, CAScaërou, FGrabarek, JBGriffiths, GJackson, WKontopidis, GMcClue, SJMcInnes, CMeades, CMezna, MPlater, AStuart, IThomas, MPWood, GClarke, RGBlake, DGZheleva, DILane, DPJackson, RCGlover, DMFischer, PM Discovery of N-phenyl-4-(thiazol-5-yl)pyrimidin-2-amine aurora kinase inhibitors. J Med Chem 53:4367-78 (2010)  
Target
Name:
Cyclin-dependent kinase 4
Synonyms:
CDK4 Cell division protein kinase 4 PSK-J3
Type:
Enzyme Subunit
Mol. Mass.:
33731.96
Organism:
Homo sapiens (Human)
Description:
P11802
Residue:
303
  
Inhibitor
Name:
BDBM50319615
Synonyms:
1-(4-(4-(4-(4-Methyl-2-(methylamino)thiazol-5-yl)pyrimidin-2-ylamino)phenyl)piperazin-1-yl)ethanone | CHEMBL1083785
Type:
Small organic molecule
Emp. Form.:
C21H25N7OS
Mol. Mass.:
423.535
SMILES:
CNc1nc(C)c(s1)-c1ccnc(Nc2ccc(cc2)N2CCN(CC2)C(C)=O)n1
: