Target
Cyclin-dependent kinase 4
Ligand
BDBM50229973
Substrate
Meas. Tech.
ChEMBL_634456 (CHEMBL1119482)
Ki
53±n/a nM
Citation
 Wang, SMidgley, CAScaërou, FGrabarek, JBGriffiths, GJackson, WKontopidis, GMcClue, SJMcInnes, CMeades, CMezna, MPlater, AStuart, IThomas, MPWood, GClarke, RGBlake, DGZheleva, DILane, DPJackson, RCGlover, DMFischer, PM Discovery of N-phenyl-4-(thiazol-5-yl)pyrimidin-2-amine aurora kinase inhibitors. J Med Chem 53:4367-78 (2010)  
Target
Name:
Cyclin-dependent kinase 4
Synonyms:
CDK4 Cell division protein kinase 4 PSK-J3
Type:
Enzyme Subunit
Mol. Mass.:
33731.96
Organism:
Homo sapiens (Human)
Description:
P11802
Residue:
303
  
Inhibitor
Name:
BDBM50229973
Synonyms:
(4-(2-Amino-4-methylthiazol-5-yl)pyrimidin-2-yl)-(3-nitrophenyl)amine CHEMBL298445 | [4-(2-AMINO-4-METHYL-THIAZOL-5-YL)-PYRIMIDIN-2-YL]-(3-NITRO-PHENYL)-AMINE
Type:
Small organic molecule
Emp. Form.:
C14H12N6O2S
Mol. Mass.:
328.349
SMILES:
Cc1nc(N)sc1-c1ccnc(Nc2cccc(c2)[N+]([O-])=O)n1
: