Target
Vasopressin V1a receptor
Ligand
BDBM50319769
Substrate
Meas. Tech.
ChEMBL_634856 (CHEMBL1120488)
Ki
49.7±n/a nM
Citation
 Crombie, ALAntrilli, TMCampbell, BACrandall, DLFailli, AAHe, YKern, JCMoore, WJNogle, LMTrybulski, EJ Synthesis and evaluation of azabicyclo[3.2.1]octane derivatives as potent mixed vasopressin antagonists. Bioorg Med Chem Lett 20:3742-5 (2010)  
Target
Name:
Vasopressin V1a receptor
Synonyms:
AVPR V1a AVPR1A V1AR_HUMAN VASOPRESSIN V1A Vasopressin V1 receptor Vasopressin receptor
Type:
Receptor
Mol. Mass.:
46820.18
Organism:
Homo sapiens (Human)
Description:
P37288
Residue:
418
  
Inhibitor
Name:
BDBM50319769
Synonyms:
(3,5'-dichloro-2'-methoxy-4'-(quinolin-8-yl)biphenyl-4-yl)((1S,5R)-1,3,3-trimethyl-6-azabicyclo[3.2.1]octan-6-yl)methanone | CHEMBL1086575
Type:
Small organic molecule
Emp. Form.:
C33H32Cl2N2O2
Mol. Mass.:
559.525
SMILES:
COc1cc(c(Cl)cc1-c1ccc(C(=O)N2C[C@]3(C)C[C@H]2CC(C)(C)C3)c(Cl)c1)-c1cccc2cccnc12
: