Target
Vasopressin V1a receptor
Ligand
BDBM50319770
Substrate
Meas. Tech.
ChEMBL_634856 (CHEMBL1120488)
Ki
7.1±n/a nM
Citation
 Crombie, ALAntrilli, TMCampbell, BACrandall, DLFailli, AAHe, YKern, JCMoore, WJNogle, LMTrybulski, EJ Synthesis and evaluation of azabicyclo[3.2.1]octane derivatives as potent mixed vasopressin antagonists. Bioorg Med Chem Lett 20:3742-5 (2010)  
Target
Name:
Vasopressin V1a receptor
Synonyms:
AVPR V1a AVPR1A V1AR_HUMAN VASOPRESSIN V1A Vasopressin V1 receptor Vasopressin receptor
Type:
Receptor
Mol. Mass.:
46820.18
Organism:
Homo sapiens (Human)
Description:
P37288
Residue:
418
  
Inhibitor
Name:
BDBM50319770
Synonyms:
(2-chloro-4-(4-(quinolin-8-yl)naphthalen-1-yl)phenyl)((1S,5R)-1,3,3-trimethyl-6-azabicyclo[3.2.1]octan-6-yl)methanone | CHEMBL1084717
Type:
Small organic molecule
Emp. Form.:
C36H33ClN2O
Mol. Mass.:
545.113
SMILES:
C[C@@]12C[C@@H](CC(C)(C)C1)N(C2)C(=O)c1ccc(cc1Cl)-c1ccc(-c2cccc3cccnc23)c2ccccc12
: