Target
Urotensin-2
Ligand
BDBM50320477
Substrate
Meas. Tech.
ChEMBL_636760 (CHEMBL1167049)
Ki
121±n/a nM
Citation
 Maryanoff, BEKinney, WA Urotensin-II receptor modulators as potential drugs. J Med Chem 53:2695-708 (2010)  
Target
Name:
Urotensin-2
Synonyms:
UTS2_RAT | Uts2
Type:
PROTEIN
Mol. Mass.:
13614.02
Organism:
Rattus norvegicus
Description:
ChEMBL_636760
Residue:
123
  
Inhibitor
Name:
BDBM50320477
Synonyms:
2,6-dichloro-N-(4-chloro-3-(2-(dimethylamino)ethoxy)phenyl)-4-(trifluoromethyl)benzenesulfonamide SB-611812
Type:
Small organic molecule
Emp. Form.:
C17H16Cl3F3N2O3S
Mol. Mass.:
491.74
SMILES:
CN(C)CCOc1cc(NS(=O)(=O)c2c(Cl)cc(cc2Cl)C(F)(F)F)ccc1Cl
: