Target
Poly [ADP-ribose] polymerase 1
Ligand
BDBM27525
Substrate
Meas. Tech.
ChEMBL_642955 (CHEMBL1176193)
IC50
1±n/a nM
Citation
 Ferraris, DV Evolution of poly(ADP-ribose) polymerase-1 (PARP-1) inhibitors. From concept to clinic. J Med Chem 53:4561-84 (2010)  
Target
Name:
Poly [ADP-ribose] polymerase 1
Synonyms:
(ARTD1 or PARP1) 2.4.2.30 ADPRT ARTD1 Human diphtheria toxin-like ADP-ribosyltransferase (ARTD1 or PARP1) NT-PARP-1 PARP1 PPOL Poly [ADP-ribose] polymerase 1 (PARP) Poly [ADP-ribose] polymerase 1 (PARP1) Poly [ADP-ribose] polymerase 1, 28-kDa form Poly [ADP-ribose] polymerase 1, processed C-terminus Poly [ADP-ribose] polymerase-1 Poly(ADP-ribose) polymerase-1 (ARTD1/PARP1) Protein poly-ADP-ribosyltransferase PARP1 | Synonyms=ADPRT
Type:
Mol. Mass.:
113114.22
Organism:
Homo sapiens (Human)
Description:
P09874
Residue:
1014
  
Inhibitor
Name:
BDBM27525
Synonyms:
N-[3-(morpholin-4-yl)propyl]-8-oxo-9-azatetracyclo[8.7.0.0^{2,7}.0^{11,16}]heptadeca-1(10),2(7),3,5,11(16),12,14-heptaene-14-sulfonamide | indeno[1,2-c]isoquinolinone, 11a
Type:
Small organic molecule
Emp. Form.:
C23H25N3O4S
Mol. Mass.:
439.527
SMILES:
O=c1[nH]c-2c(Cc3cc(ccc-23)S(=O)(=O)NCCCN2CCOCC2)c2ccccc12
: