Target
Inosine-5'-monophosphate dehydrogenase 2
Ligand
BDBM50322456
Substrate
Meas. Tech.
ChEMBL_643259 (CHEMBL1177070)
Ki
2200±n/a nM
Citation
 Chen, LWilson, DJXu, YAldrich, CCFelczak, KSham, YYPankiewicz, KW Triazole-linked inhibitors of inosine monophosphate dehydrogenase from human and Mycobacterium tuberculosis. J Med Chem 53:4768-78 (2010)  
Target
Name:
Inosine-5'-monophosphate dehydrogenase 2
Synonyms:
IMDH2_HUMAN IMPD 2 IMPDH-II Inosine 5'-monophosphate dehydrogenase II (IMPDH II) Inosine-5 -monophosphate dehydrogenase 2 | Inosine-5'-monophosphate dehydrogenase (IMPDH)
Type:
Enzyme
Mol. Mass.:
55806.87
Organism:
Homo sapiens (Human)
Description:
Recombinant IMPDH2 expressed in E. coli.
Residue:
514
  
Inhibitor
Name:
BDBM50322456
Synonyms:
6-(2-(((1-(50-Deoxy-adenosin-50-yl)-1H-1,2,3-triazol-4-yl)methyl)-amino)ethyl)-7-hydroxy-5-methoxy-4-methylisobenzofuran-1(3H)-one | CHEMBL1170848
Type:
Small organic molecule
Emp. Form.:
C25H29N9O7
Mol. Mass.:
567.5539
SMILES:
COc1c(C)c2COC(=O)c2c(O)c1CCNCc1cn(C[C@H]2O[C@H]([C@H](O)[C@@H]2O)n2cnc3c(N)ncnc23)nn1
: