Target
Kinesin-like protein KIF11
Ligand
BDBM50322579
Substrate
Meas. Tech.
ChEMBL_641759 (CHEMBL1177082)
IC50
260±n/a nM
Citation
 Oishi, SWatanabe, TSawada, JAsai, AOhno, HFujii, N Kinesin spindle protein (KSP) inhibitors with 2,3-fused indole scaffolds. J Med Chem 53:5054-8 (2010)  
Target
Name:
Kinesin-like protein KIF11
Synonyms:
EG5 KIF11_HUMAN Kinesin Spindle Protein Eg5 TRIP5 | kinesin spindle protein
Type:
PROTEIN
Mol. Mass.:
119138.97
Organism:
Homo sapiens (Human)
Description:
ChEMBL_1457426
Residue:
1056
  
Inhibitor
Name:
BDBM50322579
Synonyms:
2-(trifluoromethyl)-9H-carbazole | CHEMBL1173704
Type:
Small organic molecule
Emp. Form.:
C13H8F3N
Mol. Mass.:
235.2045
SMILES:
FC(F)(F)c1ccc2c(c1)[nH]c1ccccc21
: