Target
C5a anaphylatoxin chemotactic receptor 1
Ligand
BDBM50322620
Substrate
Meas. Tech.
ChEMBL_642035 (CHEMBL1176067)
IC50
4700±n/a nM
Citation
 Scully, CCBlakeney, JSSingh, RHoang, HNAbbenante, GReid, RCFairlie, DP Selective hexapeptide agonists and antagonists for human complement C3a receptor. J Med Chem 53:4938-48 (2010)  
Target
Name:
C5a anaphylatoxin chemotactic receptor 1
Synonyms:
C5AR C5AR1_HUMAN C5a anaphylatoxin chemotactic receptor C5a-R | CD_antigen=CD88
Type:
Enzyme
Mol. Mass.:
39347.68
Organism:
Homo sapiens (Human)
Description:
P21730
Residue:
350
  
Inhibitor
Name:
BDBM50322620
Synonyms:
(S)-2-((R)-2-((S)-2-((S)-1-((S)-2-((S)-1-((S)-6-amino-2-((S)-2-((S)-2-((S)-2-amino-3-(4-hydroxyphenyl)propanamido)-3-hydroxypropanamido)-3-phenylpropanamido)hexanoyl)pyrrolidine-2-carboxamido)-4-(methylthio)butanoyl)pyrrolidine-2-carboxamido)-4-methylpentanamido)propanamido)-5-guanidinopentanoic acid | CHEMBL1170029
Type:
Small organic molecule
Emp. Form.:
C57H88N14O13S
Mol. Mass.:
1209.46
SMILES:
[#6]-[#16]-[#6]-[#6]-[#6@H](-[#7]-[#6](=O)-[#6@@H]-1-[#6]-[#6]-[#6]-[#7]-1-[#6](=O)-[#6@H](-[#6]-[#6]-[#6]-[#6]-[#7])-[#7]-[#6](=O)-[#6@H](-[#6]-c1ccccc1)-[#7]-[#6](=O)-[#6@H](-[#6]-[#8])-[#7]-[#6](=O)-[#6@@H](-[#7])-[#6]-c1ccc(-[#8])cc1)-[#6](=O)-[#7]-1-[#6]-[#6]-[#6]-[#6@H]-1-[#6](=O)-[#7]-[#6@@H](-[#6]-[#6](-[#6])-[#6])-[#6](=O)-[#7]-[#6@H](-[#6])-[#6](=O)-[#7]-[#6@@H](-[#6]-[#6]-[#6]\[#7]=[#6](/[#7])-[#7])-[#6](-[#8])=O
: