Target
Prostaglandin G/H synthase 1
Ligand
BDBM50322749
Substrate
Meas. Tech.
ChEMBL_642350 (CHEMBL1177376)
IC50
>50000±n/a nM
Citation
 Fu, QZan, KZhao, MZhou, SShi, SJiang, YTu, P Triterpene saponins from Clematis chinensis and their potential anti-inflammatory activity. J Nat Prod 73:1234-9 (2010)  
Target
Name:
Prostaglandin G/H synthase 1
Synonyms:
COX-1 Cyclooxygenase Cyclooxygenase-1 (COX-1) PTGS1 | Prostaglandin G/H synthase (cyclooxygenase)
Type:
Enzyme
Mol. Mass.:
68692.62
Organism:
Homo sapiens (Human)
Description:
P23219
Residue:
599
  
Inhibitor
Name:
BDBM50322749
Synonyms:
CHEMBL1171449 | kizuta saponin K12
Type:
Small organic molecule
Emp. Form.:
C59H96O26
Mol. Mass.:
1221.3779
SMILES:
C[C@@H]1O[C@@H](O[C@H]2[C@H](O)[C@@H](O)[C@H](OC[C@H]3O[C@@H](OC(=O)[C@]45CCC(C)(C)C[C@H]4C4=CC[C@@H]6[C@@]7(C)CC[C@H](O[C@@H]8OC[C@H](O)[C@H](O)[C@H]8O[C@@H]8O[C@@H](C)[C@H](O)[C@@H](O)[C@H]8O)C(C)(CO)[C@@H]7CC[C@@]6(C)[C@]4(C)CC5)[C@H](O)[C@@H](O)[C@@H]3O)O[C@@H]2CO)[C@H](O)[C@H](O)[C@H]1O
: