Target
Glycogen synthase kinase-3 beta
Ligand
BDBM50322829
Substrate
Meas. Tech.
ChEMBL_644429 (CHEMBL1211213)
IC50
26±n/a nM
Citation
 Ibrahim, NMouawad, LLegraverend, M Novel 8-arylated purines as inhibitors of glycogen synthase kinase. Eur J Med Chem 45:3389-93 (2010)  
Target
Name:
Glycogen synthase kinase-3 beta
Synonyms:
GSK-3 beta GSK3B Glycogen synthase kinase 3 beta (GSK3B) Glycogen synthase kinase-3 beta (GSK-3B) Glycogen synthase kinase-3 beta (GSK3B) Glycogen synthase kinase-3beta (GSK3B) | Serine/threonine-protein kinase GSK3B
Type:
Enzyme
Mol. Mass.:
46756.38
Organism:
Homo sapiens (Human)
Description:
P49841
Residue:
420
  
Inhibitor
Name:
BDBM50322829
Synonyms:
3-(6-(phenylamino)-9H-purin-8-yl)benzonitrile | CHEMBL1210236
Type:
Small organic molecule
Emp. Form.:
C18H12N6
Mol. Mass.:
312.3281
SMILES:
N#Cc1cccc(c1)-c1nc2ncnc(Nc3ccccc3)c2[nH]1
: