Target
Cathepsin S
Ligand
BDBM50322923
Substrate
Meas. Tech.
ChEMBL_643447 (CHEMBL1212311)
EC50
138±n/a nM
Citation
 Cai, JFradera, Xvan Zeeland, MDempster, MCameron, KSBennett, DJRobinson, JPopplestone, LBaugh, MWestwood, PBruin, JHamilton, WKinghorn, ELong, CUitdehaag, JC 4-(3-Trifluoromethylphenyl)-pyrimidine-2-carbonitrile as cathepsin S inhibitors: N3, not N1 is critically important. Bioorg Med Chem Lett 20:4507-10 (2010)  
Target
Name:
Cathepsin S
Synonyms:
CATS_HUMAN Cathepsin S (Cat S) | cathepsin S preproprotein
Type:
Protein
Mol. Mass.:
37507.38
Organism:
Homo sapiens (Human)
Description:
P25774
Residue:
331
  
Inhibitor
Name:
BDBM50322923
Synonyms:
6-(4-(3-(4-methylpiperazin-1-yl)propoxy)-3-(trifluoromethyl)phenyl)picolinonitrile CHEMBL1209147
Type:
Small organic molecule
Emp. Form.:
C21H23F3N4O
Mol. Mass.:
404.4287
SMILES:
CN1CCN(CCCOc2ccc(cc2C(F)(F)F)-c2cccc(n2)C#N)CC1
: