Target
Voltage-dependent T-type calcium channel subunit alpha-1H
Ligand
BDBM50322938
Substrate
Meas. Tech.
ChEMBL_643451 (CHEMBL1212315)
IC50
4±n/a nM
Citation
 Smith, EMSorota, SKim, HMMcKittrick, BANechuta, TLBennett, CKnutson, CBurnett, DAKieselgof, JTan, ZRindgen, DBridal, TZhou, XJia, YPDong, ZMullins, DZhang, XPriestley, TCorrell, CCTulshian, DCzarniecki, MGreenlee, WJ T-type calcium channel blockers: spiro-piperidine azetidines and azetidinones-optimization, design and synthesis. Bioorg Med Chem Lett 20:4602-6 (2010)  
Target
Name:
Voltage-dependent T-type calcium channel subunit alpha-1H
Synonyms:
CAC1H_HUMAN Low-voltage-activated calcium channel alpha1 3.2 subunit Voltage-gated calcium channel voltage-dependent T-type calcium channel subunit alpha-1H isoform a
Type:
Enzyme Catalytic Domain
Mol. Mass.:
259187.68
Organism:
Homo sapiens (Human)
Description:
Calcium channel (Type T,L) 0 0::O95180
Residue:
2353
  
Inhibitor
Name:
BDBM50322938
Synonyms:
2-(3-chloro-4-fluorophenyl)-N-(3,5-difluorophenyl)-1-oxo-3-(pyridin-2-yl)-2,7-diazaspiro[3.5]nonane-7-carboxamide | CHEMBL1210565
Type:
Small organic molecule
Emp. Form.:
C25H20ClF3N4O2
Mol. Mass.:
500.9
SMILES:
Fc1cc(F)cc(NC(=O)N2CCC3(CC2)C(N(C3=O)c2ccc(F)c(Cl)c2)c2ccccn2)c1
: