Target
Mitogen-activated protein kinase 14
Ligand
BDBM50323438
Substrate
Meas. Tech.
ChEMBL_644073 (CHEMBL1211972)
IC50
6±n/a nM
Citation
 Liu, HKuhn, CFeru, FJacques, SLDeshmukh, GDYe, PRennie, GRJohnson, TKazmirski, SLow, SColi, RDing, YHCheng, ACTecle, HEnglish, JMStanton, RWu, JC Enhanced selectivity profile of pyrazole-urea based DFG-out p38alpha inhibitors. Bioorg Med Chem Lett 20:4885-91 (2010)  
Target
Name:
Mitogen-activated protein kinase 14
Synonyms:
CSAID-binding protein CSBP1 CSPB1 MAP kinase 14 MAP kinase p38 alpha MAPK14 MK14_HUMAN Mitogen-activated protein kinase p38 alpha Stress-activated protein kinase 2a | p38 MAP kinase alpha/beta
Type:
Serine/threonine-protein kinase
Mol. Mass.:
41286.76
Organism:
Homo sapiens (Human)
Description:
Q16539
Residue:
360
  
Inhibitor
Name:
BDBM50323438
Synonyms:
4-(3-(3-tert-butyl-5-(3-naphthalen-1-ylureido)-1H-pyrazol-1-yl)benzylamino)-4-oxobutanoic acid | CHEMBL1209703
Type:
Small organic molecule
Emp. Form.:
C29H31N5O4
Mol. Mass.:
513.5875
SMILES:
CC(C)(C)c1cc(NC(=O)Nc2cccc3ccccc23)n(n1)-c1cccc(CNC(=O)CCC(O)=O)c1
: