Target
Histone-lysine N-methyltransferase EHMT2
Ligand
BDBM50323811
Substrate
Meas. Tech.
ChEMBL_647515 (CHEMBL1217455)
IC50
3400000±n/a nM
Citation
 Liu, FChen, XAllali-Hassani, AQuinn, AMWigle, TJWasney, GADong, ASenisterra, GChau, ISiarheyeva, ANorris, JLKireev, DBJadhav, AHerold, JMJanzen, WPArrowsmith, CHFrye, SVBrown, PJSimeonov, AVedadi, MJin, J Protein lysine methyltransferase G9a inhibitors: design, synthesis, and structure activity relationships of 2,4-diamino-7-aminoalkoxy-quinazolines. J Med Chem 53:5844-57 (2010)  
Target
Name:
Histone-lysine N-methyltransferase EHMT2
Synonyms:
BAT8 EHMT2 G9A Histone-lysine N-methyltransferase EHMT1/EHMT2 KMT1C Protein G9a (G9a)
Type:
Enzyme
Mol. Mass.:
132339.87
Organism:
Homo sapiens (Human)
Description:
Q96KQ7
Residue:
1210
  
Inhibitor
Name:
BDBM50323811
Synonyms:
6-Methoxy-2-(4-methyl-1,4-diazepan-1-yl)-7-(4-methylpentyloxy)-N-(1-methylpiperidin-4-yl)quinazolin-4-amine | CHEMBL1213959
Type:
Small organic molecule
Emp. Form.:
C27H44N6O2
Mol. Mass.:
484.6773
SMILES:
COc1cc2c(NC3CCN(C)CC3)nc(nc2cc1OCCCC(C)C)N1CCCN(C)CC1
: