Target
Histone-lysine N-methyltransferase EHMT2
Ligand
BDBM50300036
Substrate
Meas. Tech.
ChEMBL_647513 (CHEMBL1217453)
IC50
>10000000±n/a nM
Citation
 Liu, FChen, XAllali-Hassani, AQuinn, AMWigle, TJWasney, GADong, ASenisterra, GChau, ISiarheyeva, ANorris, JLKireev, DBJadhav, AHerold, JMJanzen, WPArrowsmith, CHFrye, SVBrown, PJSimeonov, AVedadi, MJin, J Protein lysine methyltransferase G9a inhibitors: design, synthesis, and structure activity relationships of 2,4-diamino-7-aminoalkoxy-quinazolines. J Med Chem 53:5844-57 (2010)  
Target
Name:
Histone-lysine N-methyltransferase EHMT2
Synonyms:
BAT8 EHMT2 G9A Histone-lysine N-methyltransferase EHMT1/EHMT2 KMT1C Protein G9a (G9a)
Type:
Enzyme
Mol. Mass.:
132339.87
Organism:
Homo sapiens (Human)
Description:
Q96KQ7
Residue:
1210
  
Inhibitor
Name:
BDBM50300036
Synonyms:
6,7-dimethoxy-2-(4-methyl-1,4-diazepan-1-yl)-N-(tetrahydro-2H-pyran-4-yl)quinazolin-4-amine | CHEMBL583046
Type:
Small organic molecule
Emp. Form.:
C21H31N5O3
Mol. Mass.:
401.5025
SMILES:
COc1cc2nc(nc(NC3CCOCC3)c2cc1OC)N1CCCN(C)CC1
: