Target
Dipeptidyl peptidase 4
Ligand
BDBM50324507
Substrate
Meas. Tech.
ChEMBL_649272 (CHEMBL1218970)
Ki
0.9±n/a nM
Citation
 Meng, WBrigance, RPChao, HJFura, AHarrity, TMarcinkeviciene, JO'Connor, SPTamura, JKXie, DZhang, YKlei, HEKish, KWeigelt, CATurdi, HWang, AZahler, RKirby, MSHamann, LG Discovery of 6-(aminomethyl)-5-(2,4-dichlorophenyl)-7-methylimidazo[1,2-a]pyrimidine-2-carboxamides as potent, selective dipeptidyl peptidase-4 (DPP4) inhibitors. J Med Chem 53:5620-8 (2010)  
Target
Name:
Dipeptidyl peptidase 4
Synonyms:
ADABP Adenosine deaminase complexing protein 2 CD_antigen=CD26 DPP4 DPPIV Dipeptidyl peptidase 4 (DPP IV) Dipeptidyl peptidase 4 (DPP4) Dipeptidyl peptidase 4 membrane form Dipeptidyl peptidase IV Dipeptidyl peptidase IV (DDP-IV) Dipeptidyl peptidase IV membrane form Dipeptidyl peptidase-IV (DPP-4) T-cell activation antigen CD26 | TP103
Type:
Enzyme
Mol. Mass.:
88271.01
Organism:
Homo sapiens (Human)
Description:
P27487
Residue:
766
  
Inhibitor
Name:
BDBM50324507
Synonyms:
6-(aminomethyl)-5-(2,4-dichlorophenyl)-N-(furan-2-ylmethyl)-N,7-dimethylimidazo[1,2-a]pyrimidine-2-carboxamide | CHEMBL1215301
Type:
Small organic molecule
Emp. Form.:
C21H19Cl2N5O2
Mol. Mass.:
444.314
SMILES:
CN(Cc1ccco1)C(=O)c1cn2c(c(CN)c(C)nc2n1)-c1ccc(Cl)cc1Cl
: