Target
Dipeptidyl peptidase 4
Ligand
BDBM50324523
Substrate
Meas. Tech.
ChEMBL_649272 (CHEMBL1218970)
Ki
0.2±n/a nM
Citation
 Meng, WBrigance, RPChao, HJFura, AHarrity, TMarcinkeviciene, JO'Connor, SPTamura, JKXie, DZhang, YKlei, HEKish, KWeigelt, CATurdi, HWang, AZahler, RKirby, MSHamann, LG Discovery of 6-(aminomethyl)-5-(2,4-dichlorophenyl)-7-methylimidazo[1,2-a]pyrimidine-2-carboxamides as potent, selective dipeptidyl peptidase-4 (DPP4) inhibitors. J Med Chem 53:5620-8 (2010)  
Target
Name:
Dipeptidyl peptidase 4
Synonyms:
ADABP Adenosine deaminase complexing protein 2 CD_antigen=CD26 DPP4 DPPIV Dipeptidyl peptidase 4 (DPP IV) Dipeptidyl peptidase 4 (DPP4) Dipeptidyl peptidase 4 membrane form Dipeptidyl peptidase IV Dipeptidyl peptidase IV (DDP-IV) Dipeptidyl peptidase IV membrane form Dipeptidyl peptidase-IV (DPP-4) T-cell activation antigen CD26 | TP103
Type:
Enzyme
Mol. Mass.:
88271.01
Organism:
Homo sapiens (Human)
Description:
P27487
Residue:
766
  
Inhibitor
Name:
BDBM50324523
Synonyms:
CHEMBL1215018 | N-((3S)-1-(6-(aminomethyl)-5-(2,4-dichlorophenyl)-7-methylimidazo[1,2-a]pyrimidine-2-carbonyl)pyrrolidin-3-yl)methanesulfonamide
Type:
Small organic molecule
Emp. Form.:
C20H22Cl2N6O3S
Mol. Mass.:
497.398
SMILES:
Cc1nc2nc(cn2c(c1CN)-c1ccc(Cl)cc1Cl)C(=O)N1CC[C@@H](C1)NS(C)(=O)=O
: